{"text_format":"1","workbook":"xlsx","n_sheets":6,"sheets":["1 POM","2 POA","3 Disponibilidad Financiera","4 Anexo Distribución Financiera","6 Seguimiento 2026","5 Catálogo Productos 2026"],"not_rendered":{"charts":0,"images":11,"macros":1,"external_links":1,"defined_names":2,"comments":0,"pivot_tables":0},"unopened":[],"bounds":{"document_bytes":16777216,"sheet_cells":100000,"rows_first":2000,"rows_last":500,"rows_between":2000,"halvings":0,"cell_chars":16384,"cell_head_chars":4096},"cells_cut":0,"cells_raw":0,"read":"whole","date_system":"1900"}

{"sheet":"1 POM","index":0,"n_rows":19,"n_cols":53,"rows_kept":19,"cut":false,"hidden":false,"merged":[[4,13,4,18],[4,0,6,0],[4,19,4,22],[4,23,4,34],[4,35,4,52],[5,23,5,24],[5,35,6,35],[5,36,6,36],[5,38,5,40],[5,41,5,42],[5,43,5,44],[5,45,5,46],[5,47,5,48],[5,49,5,50],[5,51,5,52],[5,20,6,20],[5,21,6,21],[5,17,6,17],[5,1,6,1],[5,8,6,8],[5,9,6,9],[5,10,6,10],[5,11,6,11],[5,12,6,12],[5,7,6,7],[4,2,6,2],[4,3,6,3],[4,4,6,4],[4,5,6,5],[4,6,6,6],[4,7,4,9],[4,11,4,12],[5,13,6,13],[3,0,3,6],[3,7,3,10],[3,11,3,52],[5,37,6,37],[5,31,5,32],[5,33,5,34],[5,18,6,18],[5,19,6,19],[5,22,6,22],[5,29,5,30],[5,25,5,26],[5,27,5,28],[5,14,6,14],[5,15,6,15],[5,16,6,16]]}
[null,null,"OPCIONES:"]
["Departamento:",null,null,"Chimaltenango","Chimaltenango"]
["Municipio:",null,null,"Chimaltenango","Chimaltenango","Chimaltenango","Chimaltenango"]
["VINCULACIÓN ESTRATÉGICA",null,null,null,null,null,null,"PLANIFICACIÓN ESTRATÉGICA",null,null,null,"PLANIFICACIÓN OPERATIVA MULTIANUAL"]
["No. de Vinculación","1. PDM-OT","2) Eje K'atun","3) Prioridades Nacionales de Desarrollo","4) Metas Estratégicas de Desarrollo (MED)","5) Resultados Estratégicos  (RE)","6) Resultado Institucional (RI)","7) Resultado Municipal ",null,null,"8) Política General de Gobierno 2024-2028","9) Programa Presupuestario",null,"10) Producto",null,null,null,null,null,"11. INTERVENCIONES (PROYECTOS O ACTIVIDADES)",null,null,null,"12. Programación multianual de productos e  intervenciones",null,null,null,null,null,null,null,null,null,null,null,"13. Indicadores de Productos "]
[null,"1) Problemática/Potencialidad PDM-OT",null,null,null,null,null,"7.1 Resultado PDM_OT al 2032","7.2 Programa PDM \n(en caso no tenga PDM _OT aprobado)","7.3 Resultado PEI definido para el periodo 2026 - 2030","8.1 Eje de la PGG ","9.1 Programa Presupuestario","9.2 Subprograma","10.1 Nombre del Producto","10.2 Producto Competencia Propia","10.3 Producto Competencia delegada","10.4 Unidad de Medida","10.5 Responsable del cumplimiento de meta del producto","10.6 Corresponsable del cumplimiento de la meta del producto","11.1 Nombre de la intervención (proyecto o actividad)","11.2 Código SNIP","11.3 Código SMIP","11.4 Unidad de Medida",2026,null,2027,null,2028,null,2029,null,2030,null,"Total multianual",null,"Nombre del indicador de  producto","Fórmula del Indicador de producto","Segmento afectado por la problemática","Línea base",null,null,2026,null,2027,null,2028,null,2029,null,2030,null,"Meta del período"]
[null,null,null,null,null,null,null,null,null,null,null,null,null,null,null,null,null,null,null,null,null,null,null,"12.1 Física","12.2 Financiera Quetzales","12.3 Física","12.4 Financiera Quetzales","12.5 Física","12.6 Financiera Quetzales","12.7 Física","12.8 Financiera Quetzales","12.9 Física","12.10 Financiera Quetzales","12.11 Total Meta Física Multianual","12.12 Total Meta  financiera Multianual",null,null,null,"Año","Datos Absolutos","Datos Relativos ","Datos Absolutos","Datos relativos en porcentaje ","Datos Absolutos","Datos relativos en porcentaje ","Datos Absolutos","Datos relativos en porcentaje ","Datos Absolutos","Datos relativos en porcentaje ","Datos Absolutos","Datos relativos en porcentaje ","Datos Absolutos","Datos relativos en porcentaje "]
["No. DE VINCULACIÓN","1) Problemática/Potencialidad PDM-OT","2) Eje K'atun","3) Prioridades Nacionales de Desarrollo","4) Metas Estratégicas de Desarrollo (MED)","5) Resultados Estratégicos  (RE)","6) Resultado Institucional -RI-","7.1 Resultado PDM_OT al 2032","7.2 Programa PDM \n(en caso no tenga PDM - OT aprobado)","7.3 Resultado PEI definido para el periodo 2026 - 2030","Eje de la PGG ","9.1 Programa Presupuestario","9.2 Subprograma","Columna1","10.1 Producto Competencia Propia","10.2 Producto Competencia delegada","10.3 Unidad de Medida","10.4 Responsable del cumplimiento de meta del producto","10.5 Corresponsable del cumplimiento de la meta del producto","11.1 Nombre de la intervención (proyecto o actividad)","11.2 Código SNIP","11.3 Código SMIP","11.4 Unidad de Medida","Física 2026","Financiera 2026","Física 2027","Financiera 2027","Física 2028","Financiera 2028","Física 2029","Financiera 2029","Física 2030","Financiera 2030","12.2 Total Meta Física Multianual","12.3 Total Meta  financiera Multianual","Nombre del indicador de  producto","Fórmula del Indicador de producto","Población objertivo del producto","Año","Datos Absolutos","Datos Relativos ","Datos Absolutos 2026","Datos relativos en porcentaje 2026","Datos Absolutos 2027","Datos relativos en porcentaje 2027","Datos Absolutos 2028","Datos relativos en porcentaje 2028","Datos Absolutos 2029","Datos relativos en porcentaje 2029","Datos Absolutos 2030","Datos relativos en porcentaje 2030","Datos Absolutos MP","Datos relativos en porcentaje MP"]
[null,null,{"$f":"IFERROR(VLOOKUP(A9,'5 Catálogo Productos 2026'!$A$8:$V$116,2,),\"\")","v":""},{"$f":"IFERROR(VLOOKUP(A9,'5 Catálogo Productos 2026'!$A$8:$V$116,4,),\"\")","v":""},{"$f":"IFERROR(VLOOKUP(A9,'5 Catálogo Productos 2026'!$A$8:$V$116,5,),\"\")","v":""},{"$f":"IFERROR(VLOOKUP(A9,'5 Catálogo Productos 2026'!$A$8:$V$116,6,),\"\")","v":""},{"$f":"IFERROR(VLOOKUP(A9,'5 Catálogo Productos 2026'!$A$8:$V$116,7,FALSE),\"\")","v":""},null,null,null,{"$f":"IFERROR(VLOOKUP(A9,'5 Catálogo Productos 2026'!$A$8:$V$116,10,),\"\")","v":""},{"$f":"IFERROR(VLOOKUP(A9,'5 Catálogo Productos 2026'!$A$8:$V$116,19,),\"\")","v":""},{"$f":"IFERROR(VLOOKUP(A9,'5 Catálogo Productos 2026'!$A$8:$V$116,21,),\"\")","v":""},{"$f":"IFERROR(VLOOKUP(A9,'5 Catálogo Productos 2026'!$A$8:$V$116,11,),\"\")","v":""},{"$f":"IFERROR(VLOOKUP(A9,'5 Catálogo Productos 2026'!$A$8:$V$116,13,),\"\")","v":""},{"$f":"IFERROR(VLOOKUP(A9,'5 Catálogo Productos 2026'!$A$8:$V$116,14,),\"\")","v":""},{"$f":"IFERROR(VLOOKUP(A9,'5 Catálogo Productos 2026'!$A$8:$V$116,12,),\"\")","v":""},{"$f":"IFERROR(VLOOKUP(A9,'5 Catálogo Productos 2026'!$A$8:$V$116,16,),\"\")","v":""},{"$f":"IFERROR(VLOOKUP(A9,'5 Catálogo Productos 2026'!$A$8:$V$116,17,),\"\")","v":""},null,null,null,null,null,{"$f":"SUM(Y10:Y19)","v":0},null,{"$f":"SUM(AA10:AA19)","v":0},null,{"$f":"SUM(AC10:AC19)","v":0},null,{"$f":"SUM(AE10:AE19)","v":0},null,{"$f":"SUM(AG10:AG19)","v":0},{"$f":"X9+Z9+AB9+AD9+AF9","v":0},{"$f":"Y9+AA9+AC9+AE9+AG9","v":0},null,null,null,null,null,null,null,null,null,null,null,null,null,null,null,null,{"$f":"AP9+AR9+AT9+AV9+AX9","v":0}]
[null,null,null,null,null,null,null,null,null,null,null,null,null,null,null,null,null,null,null,null,null,null,null,null,null,null,null,null,null,null,null,null,null,{"$f":"X10+Z10+AB10+AD10+AF10","v":0},{"$f":"Y10+AA10+AC10+AE10+AG10","v":0}]
{"$rows_left_out":10}
{"sheet":"2 POA","index":1,"n_rows":8,"n_cols":24,"rows_kept":8,"cut":false,"hidden":true,"merged":[[5,22,5,23],[5,10,6,10],[5,11,6,11],[4,12,4,15],[4,6,4,11],[4,0,6,0],[5,12,6,12],[5,13,6,13],[5,14,6,14],[5,15,6,15],[5,6,6,6],[3,0,3,3],[3,4,3,23],[5,1,6,1],[5,2,6,2],[5,3,6,3],[4,4,4,5],[5,4,6,4],[5,5,6,5],[4,1,4,3],[4,16,4,23],[5,16,5,17],[5,18,5,19],[5,20,5,21],[5,7,6,7],[5,8,6,8],[5,9,6,9]]}
[null,null,"OPCIONES:"]
["Departamento:",{"$f":"'1 POM'!B2","v":0},null,null,"Chimaltenango","Chimaltenango"]
["Municipio:",{"$f":"'1 POM'!B3","v":0},null,null,"Chimaltenango","Chimaltenango",null,"Chimaltenango"]
["PLANIFICACIÓN ESTRATÉGICA",null,null,null,"PLANIFICACIÓN OPERATIVA ANUAL"]
["No. de Vinculación","1) Resultado Municipal ",null,null,"2) Programa Presupuestario",null,"3) Producto",null,null,null,null,null,"4) INTERVENCIONES (PROYECTOS O ACTIVIDADES)",null,null,null,"5) Programación anual de productos e  intervenciones"]
[null,"1.1 Resultado PDM_OT al 2032","1.2 Programa PDM \n(en caso no tenga PDM - OT aprobado)","1.3 Resultado PEI definido para el periodo 2026 - 2030","2.1 Programa Presupuestario","2.2 Subprograma","3.1 Nombre del Producto","3.2 Producto Competencia Propia","3.3 Producto Competencia delegada","3.4 Unidad de Medida","3.5 Responsable del cumplimiento de meta del producto","3.6 Corresponsable del cumplimiento de la meta del producto","4.1 Nombre de la intervención (proyecto o actividad)","4.2 Código SNIP","4.3 Código SMIP","4.4 Unidad de Medida","Primer Cuatrimestre",null,"Segundo Cuatrimestre",null,"Tercer Cuatrimestre",null,"Total Anual"]
[null,null,null,null,null,null,null,null,null,null,null,null,null,null,null,null,"5.1 Física","5.2 Financiera Quetzales","5.3 Física","5.4 Financiera Quetzales","5.5 Física","5.6 Financiera Quetzales","5.7 Total Meta Física Anual","5.8 Total Meta  financiera Anual"]
["No. de Vinculación","1.1 Resultado PDM_OT al 2032","1.2 Programa PDM \n(en caso no tenga PDM - OT aprobado)","1.3 Resultado PEI definido para el periodo 2026 - 2030","2.1 Programa Presupuestario","2.2 Subprograma","3.1 Nombre del Producto","3.2 Producto Competencia Propia","3.3 Producto Competencia delegada","3.4 Unidad de Medida","3.5 Responsable del cumplimiento de meta del producto","3.6 Corresponsable del cumplimiento de la meta del producto","4.1 Nombre de la intervención (proyecto o actividad)","4.2 Código SNIP","4.3 Código SMIP","4.4 Unidad de Medida","Física I","Financiera Quetzales I","Física II","Financiera Quetzales II","Física III","Financiera Quetzales III","12.2 Total Meta Física Multianual","12.3 Total Meta  financiera Multianual"]

{"sheet":"3 Disponibilidad Financiera","index":2,"n_rows":41,"n_cols":8,"rows_kept":41,"cut":false,"hidden":true,"merged":[[1,1,1,3],[2,1,2,3],[3,0,3,6],[4,0,4,6],[5,0,5,6],[6,0,6,6],[7,0,7,6],[8,0,8,6],[9,0,9,6],[10,0,10,6],[16,0,16,6],[17,0,17,6],[11,0,11,6],[12,0,12,6],[13,0,13,6],[14,0,14,6],[15,0,15,6]]}
[null,null,null,null,"OPCIONES:"]
["Departamento:",{"$f":"'1 POM'!B2","v":0},null,null,"Chimaltenango","Chimaltenango"]
["Municipio:",{"$f":"'1 POM'!B3","v":0},null,null,"Chimaltenango","Chimaltenango","Chimaltenango","Chimaltenango"]
["Matriz de Analisis de la Disponibilidad Financiera de la Municipalidad"]
["Instrucciones:"]
["1. Identificar la procedencia del financiamiento municipal para el 2026"]
["2. Indicar el monto total para el año 2026, según procedencia."]
["3. En el caso de inversión para proyectos que forman capital fijo, indicar el monto según procedencia. "]
["4. Indicar el porcentaje que corresponde a inversión en proyectos que forman capital fijo"]
["5.Indicar el monto de la disponibilidad financiera para el funcionamiento o los proyectos que no forman capital fijo "]
{"$rows_left_out":32}
{"sheet":"4 Anexo Distribución Financiera","index":3,"n_rows":20,"n_cols":5,"rows_kept":20,"cut":false,"hidden":true,"merged":[[3,0,3,4]]}
[]
["OPCIONES:"]
[]
["Base Legal distribución de recursos según procedencia de financiamiento a nivel municipal"]
["Procedencia del financiamiento a nivel municipal para el año 2026","% de Inversión ","% de funcionamiento","Código de Fuente Financiamiento"," Artículo y nombre de ley"]
["Situado constitucional",0.9,0.1,22,"Artículo 257, Constitución Política de la República"]
["IVA-PAZ",0.75,0.25,21,"Decreto Número 27-92, Ley del Impuesto al Valor Agregado, artículo 10 "]
["Impuesto a circulación de vehículos terrestres",0.97499999999999998,2.5000000000000001E-2,"29-02","Decreto 70-94, Ley del Impuesto sobre Circulación de Vehículos Terrestres, Marítimos y Aéreos, art. 6, 7, 8 y 9. "]
["Fonpetrol",1,0,"29-03","Decreto 71-2008, Ley del Fondo Económico para la Nación, art. 6."]
["IUSI",0.7,0.3,31,"Decreto Número 15-98, art. 2, Ley del Impuesto Único Sobre Inmuebles"]
{"$rows_left_out":11}
{"sheet":"6 Seguimiento 2026","index":4,"n_rows":8,"n_cols":26,"rows_kept":8,"cut":false,"hidden":true,"merged":[[5,16,5,19],[5,20,5,23],[5,24,5,25],[4,4,4,5],[5,8,6,8],[5,9,6,9],[3,0,3,3],[4,0,6,0],[4,1,4,3],[4,6,4,7],[5,1,6,1],[5,5,6,5],[5,6,6,6],[5,2,6,2],[5,3,6,3],[5,4,6,4],[5,7,6,7],[3,4,3,25],[4,8,4,25],[5,10,6,10],[5,11,6,11],[5,12,5,15]]}
[null,null,"OPCIONES:"]
["Departamento:",{"$f":"'1 POM'!B2","v":0}]
["Municipio:",{"$f":"'1 POM'!B3","v":0}]
["PLANIFICACIÓN ESTRATÉGICA"]
["No. de Vinculación","1) Resultado Municipal ",null,null,"2) Producto",null,"3) INTERVENCIONES (PROYECTOS O ACTIVIDADES)",null,"4) Indicadores de Seguimiento"]
[null,"1.1 Resultado PDM_OT al 2032","1.2 Programa PDM \n(en caso no tenga PDM - OT aprobado)","1.3 Resultado PEI definido para el periodo 2026 - 2030","2.1 Nombre del Producto","2.2 Unidad de Medida","3.1 Nombre de la intervención (proyecto o actividad)","3.2 Unidad de Medida","4.1 Nombre del indicador de  producto","4.2 Fórmula del Indicador de producto","4.3 Total Meta Física Anual","4.4 Total Meta  financiera Anual","Primer Cuatrimestre",null,null,null,"4.6 Segundo Cuatrimestre",null,null,null,"4.7 Tercer Cuatrimestre",null,null,null,"4.8 Total % de avance 2026"]
[null,null,null,null,null,null,null,null,null,null,null,null,"4.5 Meta física","4.6 Porcentaje  meta física programada","4.7 Meta Finaciera","4.8 Porcentaje meta finaciera programada","4.9 Meta física","4.10 Porcentaje  meta física programada","4.11 Meta Finaciera","4.12 Porcentaje meta finaciera programada","4.13 Meta física","4.14 Porcentaje  meta física programada","4.15 Meta Finaciera","4.16 Porcentaje Meta finaciera programada","4.17 Porcentaje meta física programada","4.18 Porcentaje meta física programada"]
["No. de Vinculación","1.1 Resultado PDM_OT al 2032","1.2 Programa PDM \n(en caso no tenga PDM - OT aprobado)","1.3 Resultado PEI definido para el periodo 2026 - 2030","2.1 Nombre del Producto","2.2 Unidad de Medida","3.1 Nombre de la intervención (proyecto o actividad)","3.2 Unidad de Medida","Nombre del indicador de  producto","Fórmula del Indicador de producto","Total Meta Física Anual","Total Meta  financiera Anual","Meta física I","% Meta física programada I","Meta Finaciero I","% Meta finaciera programada I","Meta física II","% Meta física programada II","Meta Finaciero II","% Meta finaciera programada II","Meta física III","% Meta física programada III","Meta Finaciero III","% Meta finaciera programada III","% Meta física programada","% Meta física programada2"]

{"sheet":"5 Catálogo Productos 2026","index":5,"n_rows":116,"n_cols":23,"rows_kept":116,"cut":false,"hidden":true,"merged":[[3,0,3,21],[4,0,4,6],[4,11,4,16],[4,17,4,21]]}
[]
[null,null,"OPCIONES:"]
[]
["Catálogo de Productos Vigentes para el período 2026-2030 (Planificación y Programación Municipal) "]
["VINCULACIÓN INSTITUCIONAL ",null,null,null,null,null,null,null,null,"POLITICA GENERAL DE GOBIERNO \nPGG 2024-2028",null,"CORRESPONDENCIA DE COMPETENCIAS",null,null,null,null,null,"PRESUPUESTO"]
["No. ","EJE K´ATUN ","OBJETIVO DE DESARROLLO SOSTENIBLE (ODS)","PRIORIDAD NACIONAL DE DESARROLLO ","META ESTRATÉGICA DE DESARROLLO ","RESULTADO ESTRATÉGICO (RE) ","RESULTADO INSTITUCIONAL ","Resultado PDM-OT\n2032","Resultado PDM-OT/PEI 2025 -2029\nintermedio/ inmediato","EJE ESTRATÉGICO ","NOMBRE DEL PRODUCTO ","UNIDAD DE MEDIDA ","COMPETENCIA MUNICIPAL","COMPLETENCIA DELEGADA ","INSTITUCIÓN RECTORA ","RESPONSABLE","CORRESPONSABLE","NÚMERO PROGRAMA","PROGRAMA PRESUPUESTARIO ","NÚMERO SUBPROGRAMA","SUBPROGRAMA ","NOMBRE DE LA ACTIVIDAD PRESUPUESTARIA","INDICADOR"]
["No_DE_VINCULACION","EJE K´ATUN ","OBJETIVO DE DESARROLLO SOSTENIBLE (ODS)","PRIORIDAD NACIONAL DE DESARROLLO ","META ESTRATÉGICA DE DESARROLLO ","RESULTADO ESTRATÉGICO (RE) ","RESULTADO INSTITUCIONAL ","Resultado PDM-OT\n2032","Resultado PDM-OT/PEI 2025 -2029\nintermedio/ inmediato/","POLITICA GENERAL DE GOBIERNO \nPGG 2024-2028/EJE ESTRATÉGICO ","NOMBRE DEL PRODUCTO ","UNIDAD DE MEDIDA ","COMPETENCIA MUNICIPAL","COMPLETENCIA DELEGADA ","INSTITUCIÓN RECTORA ","RESPONSABLE","CORRESPONSABLE","NÚMERO PROGRAMA","PROGRAMA PRESUPUESTARIO ","NÚMERO SUBPROGRAMA","SUBPROGRAMA ","NOMBRE DE LA ACTIVIDAD PRESUPUESTARIA","Número de familias que cuentan con servicios de agua apta para consumo humano, al finalizar el año 2026."]
[1,"Recursos naturales hoy y para el futuro","ODS 6 Agua limpia y saneamiento","PND 3 Acceso al agua y gestión de los recursos naturales","MED 4 Para 2030, lograr la ordenación sostenible y el uso eficiente de los recursos naturales \n\n","Para el 2029, se ha incrementado en 108 puntos porcentuales el acceso a agua potable domiciliar en los hogares guatemaltecos (de 763% en 2014 a 8710% en 2024)",null,"Para el año 2032, en el municipio XXX se ha incrementado en XX% las familias con acceso a agua potable, en el municipio XX (De XX% en el año XXX a XX% en el año 2032)","Para el año 2029,  se ha incrementado en XX% las familias con acceso a agua potable, en el municipio XXXX (De XX% en el año XXX a XX% en el año 2029)","Lucha contra la desnutrición y malnutrición","Familias con servicios de agua apta para consumo humano  ","familia","X",null,"MUNICIPALIDAD ","MUNICIPALIDAD ","MUNICIPALIDAD ",12,"Nombre: Acceso al agua potable y Saneamiento básico\nDescripción: Acceso al agua potable y Saneamiento básico",1,"Nombre: Incremento en el acceso al agua potable domiciliar\nDescripción: Incremento en el acceso al agua potable domiciliar","Nombre: Familias con abastecimiento domiciliario de agua potable \nDescripción: Familias con servicios de agua apta para consumo humano  ","Número de familias que cuentan con servicios de agua apta para consumo humano, al finalizar el año 2026."]
[2,"Recursos naturales hoy y para el futuro","ODS 6 Agua limpia y saneamiento\n\n","PND 3 Acceso al agua y gestión de los recursos naturales","MED 4 Para 2030, lograr la ordenación sostenible y el uso eficiente de los recursos naturales \n\n","Para el 2029, se ha incrementado en 21 puntos porcentuales el  acceso a saneamiento básico en los hogares guatemaltecos (De 533% en 2014 a 743% en 2024)",null,"Para el 2032 se ha incrementado en XX% el acceso a servicios de drenajes en el municipio de XXX (De XX % en el año XXX a XX% en el año XXX)","Para el 2029 se ha incrementado en XX% el acceso a servicios de drenajes en el municipio de XXX (De XX % en el año XXX a XX% en el año XXX)","Lucha contra la desnutrición y malnutrición","Familias beneficiadas con drenajes, alcantarillado, fosa séptica y planta de tratamiento de agua\n\n\n","familia","X",null,"MUNICIPALIDAD ","MUNICIPALIDAD ","MUNICIPALIDAD ",12,"Nombre: Acceso al agua potable y Saneamiento básico\nDescripción: Acceso al agua potable y Saneamiento básico",2,"Nombre: Incremento al acceso a saneamiento básico \nDescripción: Incremento al acceso a saneamiento básico ","Nombre: Sistema de saneamiento de agua\nDescripción: Familias beneficiadas con drenajes, alcantarillado, fosa séptica y planta de tratamiento de agua","Número de familias que cuentan con drenajes, alcantarillado, fosa séptica y planta de tratamiento de agua, al finalizar el año 2026."]
[3,"Recursos naturales hoy y para el futuro","ODS 6 Agua limpia y saneamiento","PND 3 Acceso al agua y gestión de los recursos naturales","MED 4 Para 2030, lograr la ordenación sostenible y el uso eficiente de los recursos naturales \n\n","Para el 2029, se ha incrementado en 21 puntos porcentuales el  acceso a saneamiento básico en los hogares guatemaltecos (De 533% en 2014 a 743% en 2024)",null,"Para el año 2032, se ha incrementado en XX% las  familias con servicio de recolección, tratamiento y disposición final de desechos y residuos sólidos, en el municipio XX (De XX% en el año XXX a XX% en el año 2032)","Para el año 2029, se ha incrementado en XX% las  familias con servicio de recolección, tratamiento y disposición final de desechos y residuos sólidos,  en el municipio XXX (De XX% en el año XXX a XX% en el año 2029)","Lucha contra la desnutrición y malnutrición","Familias con servicio de recolección, tratamiento y disposición final de desechos y residuos sólidos hasta su disposición final, Limpieza y ornato\n\n","familia","X",null,"MUNICIPALIDAD ","MUNICIPALIDAD ","MUNICIPALIDAD ",12,"Nombre: Acceso al agua potable y Saneamiento básico\nDescripción: Acceso al agua potable y Saneamiento básico",2,"Nombre: Incremento al acceso a saneamiento básico \nDescripción: Incremento al acceso a saneamiento básico ","Nombre: Servicios de recolección, tratamiento y disposición final de desechos y residuos sólidos\nDescripción: Familias con servicio de recolección, tratamiento y disposición final de desechos y residuos sólidos hasta su disposición final, Limpieza y ornato","Número de familias que cuentan con servicio de recolección, tratamiento y disposición final de desechos y residuos sólidos hasta su disposición final, Limpieza y ornato, al finalizar el año 2026."]
{"$rows_left_out":106}